{"text_format":"1","workbook":"xlsx","n_sheets":8,"sheets":["Face Page","Base Budget","Mod Budget Form","Form Page 4","Form Page 5","Checklist","Tuition","SPA USE ONLY"],"not_rendered":{"charts":0,"images":1,"macros":0,"external_links":7,"defined_names":99,"comments":4,"pivot_tables":0},"unopened":[],"bounds":{"document_bytes":16777216,"sheet_cells":100000,"rows_first":2000,"rows_last":500,"rows_between":2000,"halvings":0,"cell_chars":16384,"cell_head_chars":4096},"cells_cut":0,"cells_raw":0,"read":"whole","date_system":"1900"}

{"sheet":"Face Page","index":0,"n_rows":53,"n_cols":18,"rows_kept":53,"cut":false,"hidden":true,"merged":[[37,7,37,12],[38,5,38,6],[46,13,46,14],[2,8,2,9],[4,0,5,6],[22,10,23,11],[22,12,23,13],[30,7,30,8],[30,9,30,12],[30,13,30,14]]}
["Form Approved Through 6/30/2016",null,null,null,null,null,null,null,null,null,null,null,null,null,"OMB No.   0925-0001  "]
["Department of Health and Human Services",null,null,null,null,null,null,"  LEAVE BLANK—FOR PHS USE ONLY."]
["Public Health Services",null,null,null,null,null,null,"  Type"," Activity",null,null,"Number"]
[null,null,null,null,null,null,null,"  Review Group",null,null,null,"Formerly"]
["Do not exceed character length restrictions indicated.",null,null,null,null,null,null,"  Council/Board (Month, Year)",null,null,null,"Date Received"]
[]
["1.   TITLE OF PROJECT (Do not exceed 81 characters, including spaces and punctuation.)"]
[]
["2.   RESPONSE TO SPECIFIC REQUEST FOR APPLICATIONS OR PROGRAM ANNOUNCEMENT OR SOLICITATION",null,null,null,null,null,null,null,null,null,null,null,null,"NO","YES"]
["   (If \"Yes,\" state number and title)"]
["Number:",null,null,"      Title:"]
["3.  PROGRAM DIRECTOR/PRINCIPAL INVESTIGATOR"]
["3a.  NAME (Last, first, middle)",null,null,null,null,null,null,"3b.   DEGREE(S)",null,null,"3h.","  eRA Commons User Name"]
[]
["3c.  POSITION TITLE",null,null,null,null,null,null,"3d.   MAILING ADDRESS  (Street, city, state, zip code)"]
[]
["3e.  DEPARTMENT, SERVICE, LABORATORY, OR EQUIVALENT"]
[]
["3f.  MAJOR SUBDIVISION",null,null,null,null,null,null,null,"Ames, IA 50011-xxxx"]
[]
["3g.  TELEPHONE AND FAX  (Area code, number and extension)",null,null,null,null,null,null,"E-MAIL ADDRESS:"]
[" TEL:","(515) 294-xxxx",null,null,"    FAX:",null,"(515) 294-xxxx"]
["4.  HUMAN SUBJECTS RESEARCH",null,null,null,null,"4a.  Research Exempt",null," If \"Yes,\" Exemption No. "]
["           No","        Yes",null,null,null,"          No             Yes"]
["4b.  Federal-Wide Assurance No.",null,null,null,null,"4c.  Clinical Trial",null,null,null,"4d.  NIH-defined Phase III Clinical Trial"]
[null,null,null,null,null,"          No             Yes",null,null,null,"        No",null,"Yes"]
["5.   VERTEBRATE ANIMALS",null,null,"   No","         Yes",null,null,"5a. Animal Welfare Assurance No."]
["6.  DATES OF PROPOSED PERIOD OF",null,null,null,null,null,"7.  COSTS REQUESTED FOR INITIAL",null,null,"8.   COSTS REQUESTED FOR PROPOSED",null,null,null,null,null," ","  "," "]
["     SUPPORT (month, day, year--MM/DD/YY)",null,null,null,null,null,"     BUDGET PERIOD",null,null,"      PERIOD OF SUPPORT",null,null,null,null,null,null," "]
["From",null,"Through",null,null,null,"7a.  Direct Costs ($)","7b.  Total Costs ($)",null,"8a.  Direct Costs ($)",null,null,null,"8b.  Total Costs ($)"]
{"$rows_left_out":24}
{"sheet":"Base Budget","index":1,"n_rows":209,"n_cols":34,"rows_kept":209,"cut":false,"hidden":false,"merged":[[1,29,1,31],[2,29,2,31],[0,2,1,8],[15,11,16,15],[19,13,19,19],[11,11,14,17],[21,2,24,2],[21,3,21,8],[22,3,22,8],[23,3,23,8],[24,3,24,8],[202,4,203,6],[25,3,25,8],[26,6,27,19],[212,11,212,13],[213,11,213,13],[210,14,211,19],[212,14,212,15],[213,14,213,15],[210,11,211,13],[142,2,142,4]]}
[null,null,"NIH Modular Grant Worksheet,    1 - 5 Years"]
[null,null,null,null,null,null,null,null,null,null,null,null,null,null,null,null,null,null,null,null,null,null,null,null,null,null,null,null,null,"Eff 7/1/2016"]
[null,null,"Iowa State University",null,null,null,null,null,null,null,null,null,null,null,null,null,null,null,null,null,null,null,null,null,null,null,null,null,null,"Updated 9/21/2016"]
[]
[null,null,"Indirect Cost Categories:"]
[null,null,0.5,null,"On-Campus Organized Research"]
[null,null,0.51,null,"On Campus Instruction"]
[null,null,0.32,null,"On-Campus Other Sponsored Activities"]
[null,null,0.26,null,"Off-Campus All Programs"]
[]
[]
[null,null,"Increment Rate (Non-Personnel)",null,null,null,0]
[null,null,"Increment Rate (Personnel)",null,null,null,0]
[null,null,"Faculty Benefits",null,null,null,0.27500000000000002]
[null,null,"P&S Benefits",null,null,null,0.34499999999999997]
[null,null,"Merit Benefits",null,null,null,0.45800000000000002]
[null,null,"Post Doc",null,null,null,0.32900000000000001]
[null,null,"Undergraduate",null,null,null,6.0000000000000001E-3]
[null,null,"Graduate Assistants (per year)",null,null,null,9.8000000000000004E-2,null,null,null,null,"Note:  A module is any multiple of $25,000 up to, and including $250,000."]
[null,null,"F&A (Indirect) Rate",null,null,null,0.5,null,null,null,null,1,null,"<< Number of Years for Project"]
[]
[]
[]
[]
[]
[]
[null,null,null,null,null,null,"NIH Salary Cap policy @ http://grants.nih.gov/grants/guide/notice-files/NOT-OD-12-035.html"]
[null,null,"Personnel"]
[]
[null,null,null,null,"Faculty: Enter Either Summer (SM) Academic (AY) or Calendar (CM) Months"]
{"$rows_left_out":180}
{"sheet":"Mod Budget Form","index":2,"n_rows":57,"n_cols":12,"rows_kept":57,"cut":false,"hidden":false,"merged":[[4,0,5,12],[9,9,9,10],[8,11,8,12],[6,11,6,12],[7,11,7,12],[9,11,9,12],[7,5,7,6],[7,7,7,8],[9,1,9,2],[9,3,9,4],[1,8,1,10],[10,3,10,4],[10,7,10,8],[10,5,10,6],[6,9,6,10],[10,9,10,10],[1,1,1,7],[6,1,6,2],[10,1,10,2],[3,0,3,12],[7,0,8,0],[7,1,7,2],[7,3,7,4],[7,9,7,10],[8,1,8,2],[8,3,8,4],[56,8,56,12],[6,3,6,4],[6,5,6,6],[6,7,6,8],[10,11,10,12],[9,5,9,6],[9,7,9,8],[8,5,8,6],[8,7,8,8],[8,9,8,10]]}
[]
[null,"Principal Investigator/Program Director (Last, First, Middle):",null,null,null,null,null,null,{"$f":"+'Base Budget'!C33","v":"PI name"}]
[]
["BUDGET JUSTIFICATION PAGE"]
["MODULAR RESEARCH GRANT APPLICATION"]
[]
[null,"Initial Period ",null,"2nd",null,"3rd",null,"4th",null,"5th",null,"Sum Total (For Entire Project Period)"]
["DC less Consortium F&A",{"$f":"+'Base Budget'!L173+'Base Budget'!L194","v":0},null,{"$f":"+'Base Budget'!N173+'Base Budget'!N194","v":0},null,{"$f":"+'Base Budget'!P173+'Base Budget'!P194","v":0},null,{"$f":"+'Base Budget'!R173+'Base Budget'!R194","v":0},null,{"$f":"+'Base Budget'!T173+'Base Budget'!T194","v":0},null,{"$f":"SUM(B8:K8)","v":0}]
[null,"(Item 7a, Face Page)",null,null,null,null,null,null,null,null,null,"(Item 8a, Face Page)"]
["Consortium F&A",{"$f":"+'Base Budget'!L195","v":0},null,{"$f":"+'Base Budget'!N195","v":0},null,{"$f":"+'Base Budget'!P195","v":0},null,{"$f":"+'Base Budget'!R195","v":0},null,{"$f":"+'Base Budget'!T195","v":0},null,{"$f":"SUM(B10:K10)","v":0}]
["Total Direct Costs",{"$f":"SUM(B8:C10)","v":0},null,{"$f":"SUM(D8:E10)","v":0},null,{"$f":"SUM(F8:G10)","v":0},null,{"$f":"SUM(H8:I10)","v":0},null,{"$f":"SUM(J8:K10)","v":0},null,{"$f":"SUM(B11:K11)","v":0}]
[]
["Personnel"]
[]
[]
[]
[]
[]
[]
[]
[]
[]
[]
[]
[]
[]
[]
[]
[]
[]
{"$rows_left_out":28}
{"sheet":"Form Page 4","index":3,"n_rows":65,"n_cols":13,"rows_kept":65,"cut":false,"hidden":true,"merged":[[27,9,28,9],[3,12,5,12],[62,0,62,5],[60,7,60,10],[11,5,12,5],[13,5,14,5],[15,5,16,5],[17,5,18,5],[19,5,20,5],[21,5,22,5],[27,5,28,5],[11,6,12,6],[13,6,14,6],[15,6,16,6],[17,6,18,6],[19,6,20,6],[21,6,22,6],[63,6,63,7],[2,10,2,12],[14,0,14,4],[16,0,16,4],[18,0,18,4],[20,0,20,4],[22,0,22,4],[58,0,58,6],[60,11,60,12],[58,11,58,12],[59,11,59,12],[61,11,61,12],[61,0,61,6],[60,0,60,5],[59,0,59,8],[4,11,5,11],[1,1,1,7],[58,7,58,10],[24,0,24,4],[26,0,26,4],[28,0,28,4],[12,0,12,4],[2,4,2,8],[4,10,5,10],[23,5,24,5],[25,5,26,5],[23,6,24,6],[25,6,26,6],[27,6,28,6],[11,7,12,7],[11,8,12,8],[13,7,14,7],[13,8,14,8],[15,7,16,7],[15,8,16,8],[17,7,18,7],[17,8,18,8],[19,7,20,7],[19,8,20,8],[21,7,22,7],[21,8,22,8],[27,7,28,7],[27,8,28,8],[23,7,24,7],[23,8,24,8],[25,7,26,7],[25,8,26,8]]}
[]
["::"]
[null,null,null,null,"Principal Investigator/Program Director (Last,First, Middle):",null,null,null,null,null,{"$f":"+'Base Budget'!C33","v":"PI name"}]
[null,null,null,null,"          DETAILED BUDGET FOR INITIAL BUDGET PERIOD",null,null,null,null,null,"FROM","THROUGH"]
[null,null,null,null,null,"DIRECT COSTS ONLY"]
[]
["PERSONNEL (Applicant organization only)"]
["Use Cal, Acad, or Summer to Enter Months Devoted to Project"]
["Enter Dollar Amounts Requested (omit cents) for Salary Requested and Fringe Benefits"]
[null,null,null,null,null,"ROLE ON","Cal.","Acad.","Sum.","INST.BASE","SALARY","FRINGE"]
[null,null,null,"NAME",null,"PROJECT","Months  ","Months","Months",null,"REQUESTED","BENEFITS","TOTALS"]
[null,null,null,null,null,"Principal Investigator"]
[{"$f":"VLOOKUP(1,'Base Budget'!$A$33:C88,3,FALSE)","v":{"$error":"#N/A"}}]
[]
[{"$f":"VLOOKUP(2,'Base Budget'!A33:C88,3,FALSE)","v":{"$error":"#N/A"}}]
[]
[{"$f":"VLOOKUP(3,'Base Budget'!A33:C88,3,FALSE)","v":{"$error":"#N/A"}}]
[]
[{"$f":"VLOOKUP(4,'Base Budget'!A33:C88,3,FALSE)","v":{"$error":"#N/A"}}]
[]
[{"$f":"VLOOKUP(5,'Base Budget'!A33:C88,3,FALSE)","v":{"$error":"#N/A"}}]
[]
[{"$f":"VLOOKUP(6,'Base Budget'!A33:C88,3,FALSE)","v":{"$error":"#N/A"}}]
[]
[{"$f":"VLOOKUP(7,'Base Budget'!A33:C88,3,FALSE)","v":{"$error":"#N/A"}}]
[]
[{"$f":"VLOOKUP(8,'Base Budget'!A33:C88,3,FALSE)","v":{"$error":"#N/A"}}]
[]
[{"$f":"VLOOKUP(9,'Base Budget'!A33:C88,3,FALSE)","v":{"$error":"#N/A"}}]
[]
{"$rows_left_out":36}
{"sheet":"Form Page 5","index":4,"n_rows":59,"n_cols":12,"rows_kept":59,"cut":false,"hidden":true,"merged":[[37,4,39,4],[1,1,1,7],[1,8,1,10]]}
["::"]
[null,"                             Principal Investigator/Program Director (Last,First, Middle):",null,null,null,null,null,null,{"$f":"+'Base Budget'!C33","v":"PI name"}]
[null,null,null,null,null,"BUDGET FOR ENTIRE PROPOSED PROJECT PERIOD"]
[null,null,null,null,null,null,"DIRECT COSTS ONLY"]
[null,null,null,null,null,"INITIAL BUDGET",null,null,"2nd ADDITIONAL","3rd ADDITIONAL","4th ADDITIONAL","5th ADDITIONAL"]
[null,"BUDGET CATEGORY",null,null,null,"PERIOD",null,null,"YEAR OF SUPPORT ","YEAR OF SUPPORT ","YEAR OF SUPPORT ","YEAR OF SUPPORT "]
[null,null,"TOTALS",null,null,"(from Form Page 4)",null,null,"REQUESTED","REQUESTED","REQUESTED","REQUESTED"]
["PERSONNEL: Salary and fringe"]
["benefits. Applicant organization",null,null,null,null,{"$f":"+'Base Budget'!L100","v":0},null,null,{"$f":"+'Base Budget'!N100","v":0},{"$f":"+'Base Budget'!P100","v":0},{"$f":"+'Base Budget'!R100","v":0},{"$f":"+'Base Budget'!T100","v":0}]
["only."]
[]
["CONSULTANT COSTS",null,null,null,null,{"$f":"+'Base Budget'!L108","v":0},null,null,{"$f":"+'Base Budget'!N108","v":0},{"$f":"+'Base Budget'!P108","v":0},{"$f":"+'Base Budget'!R108","v":0},{"$f":"+'Base Budget'!T108","v":0}]
[]
[]
["EQUIPMENT",null,null,null,null,{"$f":"+'Base Budget'!L117","v":0},null,null,{"$f":"+'Base Budget'!N117","v":0},{"$f":"+'Base Budget'!P117","v":0},{"$f":"+'Base Budget'!R117","v":0},{"$f":"+'Base Budget'!T117","v":0}]
[]
[]
["SUPPLIES",null,null,null,null,{"$f":"+'Base Budget'!L134","v":0},null,null,{"$f":"+'Base Budget'!N134","v":0},{"$f":"+'Base Budget'!P134","v":0},{"$f":"+'Base Budget'!R134","v":0},{"$f":"+'Base Budget'!T134","v":0}]
[]
[]
["TRAVEL",null,null,null,null,{"$f":"+'Base Budget'!L156","v":0},null,null,{"$f":"+'Base Budget'!N156","v":0},{"$f":"+'Base Budget'!P156","v":0},{"$f":"+'Base Budget'!R156","v":0},{"$f":"+'Base Budget'!T156","v":0}]
[]
[]
["INPATIENT CARE COSTS",null,null,null,null,{"$f":"+'Base Budget'!L138","v":0},null,null,{"$f":"+'Base Budget'!N138","v":0},{"$f":"+'Base Budget'!P138","v":0},{"$f":"+'Base Budget'!R138","v":0},{"$f":"+'Base Budget'!T138","v":0}]
[]
["OUTPATIENT CARE COSTS",null,null,null,null,{"$f":"+'Base Budget'!L139","v":0},null,null,{"$f":"+'Base Budget'!N139","v":0},{"$f":"+'Base Budget'!P139","v":0},{"$f":"+'Base Budget'!R139","v":0},{"$f":"+'Base Budget'!T139","v":0}]
["ALTERATIONS AND"]
["RENOVATIONS",null,null,null,null,{"$f":"+'Base Budget'!L148","v":0},null,null,{"$f":"+'Base Budget'!N148","v":0},{"$f":"+'Base Budget'!P148","v":0},{"$f":"+'Base Budget'!R148","v":0},{"$f":"+'Base Budget'!T148","v":0}]
[]
["OTHER EXPENSES",null,null,null,null,{"$f":"+'Base Budget'!L171","v":0},null,null,{"$f":"+'Base Budget'!N171","v":0},{"$f":"+'Base Budget'!P171","v":0},{"$f":"+'Base Budget'!R171","v":0},{"$f":"+'Base Budget'!T171","v":0}]
{"$rows_left_out":30}
{"sheet":"Checklist","index":5,"n_rows":53,"n_cols":18,"rows_kept":53,"cut":false,"hidden":false,"merged":[[37,5,37,6],[37,9,37,10],[38,5,38,6],[38,9,38,10],[39,5,39,6],[39,9,39,10],[36,5,36,6],[36,9,36,10],[0,9,0,11],[7,10,8,10],[14,8,14,10],[35,5,35,6],[35,9,35,10]]}
[null,null,null,null,null,null,"Program Director/Principal Investigator (Last, First, Middle):",null,null,{"$f":"'Base Budget'!C33","v":"PI name"}]
["CHECKLIST "]
[" TYPE OF APPLICATION (Check all that apply.)",null,null,null,null," "]
[null," NEW application.  (This application is being submitted to the PHS for the first time.)"]
[" "," RESUBMISSION of application number:",null,null,null," "]
[null," (This application replaces a prior unfunded version of a new, renewal, or revision application.)"]
[null," RENEWAL of grant number:"]
[null," (This application is to extend a funded grant beyond its current project period.)"]
[" ",null,null,null,null,null,null,null,null," "]
[" ","  REVISION to grant number:",null,null,null," ",null,null,null," "]
[null,"  (This application is for additional funds to supplement a currently funded grant.)"]
[" ","  CHANGE of program director/principal investigator.",null,null,null,null,null,null,null,null," "]
[null,"  Name of former program director/principal investigator:",null,null,null,null," "]
[" ","  CHANGE of Grantee Institution.     Name of former institution:",null,null,null,null,null,null,null,null," "]
[" ","  FOREIGN application ",null,"       Domestic Grant with foreign involvement",null,null,null,null,"List Country(ies) Involved:"]
["INVENTIONS AND PATENTS (Renewal appl. only)",null,null,null,null,"       No","      Yes"]
[null,null,null,null,null,null,"   If \"Yes,\" ",null,"Previously reported",null,null,null,null,null,"Not previously reported                             "]
["1. PROGRAM INCOME (See instructions.)"]
["All applications must indicate whether program income is anticipated during the period(s) for which grant support is requested.  If program income is",null,null,null,null,null,null,null,null,null,null,null,null,null,null,null,null," "]
["anticipated, use the format below to reflect the amount and source(s)."]
["                 Budget Period",null,null,"                                    Anticipated Amount",null,null,null,null,null,null,"                              Source(s)",null,null,null,null,null," "]
[null,"N/A",null,null,"N/A",null,null,null,null,null,"N/A"]
[]
[]
[]
["2.  ASSURANCES/CERTIFICATIONS (See instructions.)"]
["In signing the application Face Page, the authorized organizational representative agrees to comply with the policies, assurances and/or certifications"]
["listed in the application instructions when applicable. Descriptions of individual assurances/certifications are provided in Part III and listed in Part I, 4.1 "]
["under item 14.  If unable to certify compliance, where applicable, provide an explanation and place it after this page."]
["3. FACILITIES AND ADMINISTRATIVE COSTS (F&A)/ INDIRECT COSTS. See specific instructions."]
{"$rows_left_out":24}
{"sheet":"Tuition","index":6,"n_rows":158,"n_cols":19,"rows_kept":158,"cut":false,"hidden":false,"merged":[[22,2,22,3],[38,0,42,0],[38,2,38,3],[40,2,40,3],[42,2,42,3],[32,0,36,0],[32,2,32,3],[34,2,34,3],[36,2,36,3],[25,2,25,5],[26,2,26,5],[27,2,27,5],[18,0,22,0],[18,2,18,3],[20,2,20,3],[30,2,30,7],[5,2,5,5],[6,2,6,5],[7,2,7,5],[12,0,16,0],[12,2,12,3],[14,2,14,3],[16,2,16,3],[10,2,10,7],[129,8,129,16],[2,2,2,8],[99,8,99,16],[66,2,66,8],[58,0,62,0],[58,2,58,3],[60,2,60,3],[62,2,62,3],[45,2,45,5],[52,0,56,0],[52,2,52,3],[54,2,54,3],[56,2,56,3],[46,2,46,5],[47,2,47,5],[50,2,50,7]]}
[null,null,"           Tuition Costs",null,null,null,null,null,null,null,"Year 1",null,"Year 2",null,"Year 3",null,"Year 4",null,"Year 5"]
[]
[null,null,null,null,null,null,null,null,null,null,"Funds Requested",null,"Funds Requested",null,"Funds Requested",null,"Funds Requested",null,"Funds Requested"]
[]
[]
[8,null,"Graduate Student Tuition (most Majors)",null,null,null,"select 1/4-time/1/2-time > >",null,"1/2-time",null,{"$f":"ROUND(IF(I6=\"1/2-time\",K7,K8),0)","v":0},null,{"$f":"ROUND(IF(I6=\"1/2-time\",M7,M8),0)","v":0},null,{"$f":"ROUND(IF(I6=\"1/2-time\",O7,O8),0)","v":0},null,{"$f":"ROUND(IF(I6=\"1/2-time\",Q7,Q8),0)","v":0},null,{"$f":"ROUND(IF(I6=\"1/2-time\",S7,S8),0)","v":0}]
[8,null,"Graduate Student Tuition",null,null,null,null,null,"Maximum",null,{"$f":"+C13*VLOOKUP(K13,$I$73:$Q$99,5,FALSE)+C15*VLOOKUP(K15,$I$73:$Q$99,5,FALSE)+C17*VLOOKUP(K17,$I$73:$Q$99,5,FALSE)+C19*VLOOKUP(K19,$I$73:$Q$99,9,FALSE)+C21*VLOOKUP(K21,$I$73:$Q$99,9,FALSE)+C23*VLOOKUP(K23,$I$73:$Q$99,9,FALSE)","v":0},null,{"$f":"+E13*VLOOKUP(M13,$I$73:$Q$99,5,FALSE)+E15*VLOOKUP(M15,$I$73:$Q$99,5,FALSE)+E17*VLOOKUP(M17,$I$73:$Q$99,5,FALSE)+E19*VLOOKUP(M19,$I$73:$Q$99,9,FALSE)+E21*VLOOKUP(M21,$I$73:$Q$99,9,FALSE)+E23*VLOOKUP(M23,$I$73:$Q$99,9,FALSE)","v":0},null,{"$f":"+F13*VLOOKUP(O13,$I$73:$Q$99,5,FALSE)+F15*VLOOKUP(O15,$I$73:$Q$99,5,FALSE)+F17*VLOOKUP(O17,$I$73:$Q$99,5,FALSE)+F19*VLOOKUP(O19,$I$73:$Q$99,9,FALSE)+F21*VLOOKUP(O21,$I$73:$Q$99,9,FALSE)+F23*VLOOKUP(O23,$I$73:$Q$99,9,FALSE)","v":0},null,{"$f":"+G13*VLOOKUP(Q13,$I$73:$Q$99,5,FALSE)+G15*VLOOKUP(Q15,$I$73:$Q$99,5,FALSE)+G17*VLOOKUP(Q17,$I$73:$Q$99,5,FALSE)+G19*VLOOKUP(Q19,$I$73:$Q$99,9,FALSE)+G21*VLOOKUP(Q21,$I$73:$Q$99,9,FALSE)+G23*VLOOKUP(Q23,$I$73:$Q$99,9,FALSE)","v":0},null,{"$f":"+H13*VLOOKUP(S13,$I$73:$Q$99,5,FALSE)+H15*VLOOKUP(S15,$I$73:$Q$99,5,FALSE)+H17*VLOOKUP(S17,$I$73:$Q$99,5,FALSE)+H19*VLOOKUP(S19,$I$73:$Q$99,9,FALSE)+H21*VLOOKUP(S21,$I$73:$Q$99,9,FALSE)+H23*VLOOKUP(S23,$I$73:$Q$99,9,FALSE)","v":0}]
[8,null,"Graduate Student Tuition",null,null,null,null,null,"Minimum",null,{"$f":"+C13*VLOOKUP(K13,$I$73:$Q$99,3,FALSE)+C15*VLOOKUP(K15,$I$73:$Q$99,3,FALSE)+C17*VLOOKUP(K17,$I$73:$Q$99,3,FALSE)+C19*VLOOKUP(K19,$I$73:$Q$99,7,FALSE)+C21*VLOOKUP(K21,$I$73:$Q$99,7,FALSE)+C23*VLOOKUP(K23,$I$73:$Q$99,7,FALSE)","v":0},null,{"$f":"+E13*VLOOKUP(M13,$I$73:$Q$99,3,FALSE)+E15*VLOOKUP(M15,$I$73:$Q$99,3,FALSE)+E17*VLOOKUP(M17,$I$73:$Q$99,3,FALSE)+E19*VLOOKUP(M19,$I$73:$Q$99,7,FALSE)+E21*VLOOKUP(M21,$I$73:$Q$99,7,FALSE)+E23*VLOOKUP(M23,$I$73:$Q$99,7,FALSE)","v":0},null,{"$f":"+F13*VLOOKUP(O13,$I$73:$Q$99,3,FALSE)+F15*VLOOKUP(O15,$I$73:$Q$99,3,FALSE)+F17*VLOOKUP(O17,$I$73:$Q$99,3,FALSE)+F19*VLOOKUP(O19,$I$73:$Q$99,7,FALSE)+F21*VLOOKUP(O21,$I$73:$Q$99,7,FALSE)+F23*VLOOKUP(O23,$I$73:$Q$99,7,FALSE)","v":0},null,{"$f":"+G13*VLOOKUP(Q13,$I$73:$Q$99,3,FALSE)+G15*VLOOKUP(Q15,$I$73:$Q$99,3,FALSE)+G17*VLOOKUP(Q17,$I$73:$Q$99,3,FALSE)+G19*VLOOKUP(Q19,$I$73:$Q$99,7,FALSE)+G21*VLOOKUP(Q21,$I$73:$Q$99,7,FALSE)+G23*VLOOKUP(Q23,$I$73:$Q$99,7,FALSE)","v":0},null,{"$f":"+H13*VLOOKUP(S13,$I$73:$Q$99,3,FALSE)+H15*VLOOKUP(S15,$I$73:$Q$99,3,FALSE)+H17*VLOOKUP(S17,$I$73:$Q$99,3,FALSE)+H19*VLOOKUP(S19,$I$73:$Q$99,7,FALSE)+H21*VLOOKUP(S21,$I$73:$Q$99,7,FALSE)+H23*VLOOKUP(S23,$I$73:$Q$99,7,FALSE)","v":0}]
[]
[]
[null,null,"Graduate Student Tuition (most majors)"]
[null,null,"Year 1",null,"Year 2","Year 3","Year 4","Year 5"]
["Masters Students (enter no. of students per term)",null,null,null,null,null,null,null,"Summer",null,"Summer 2016",null,"Summer 2017",null,"Summer 2018",null,"Summer 2019",null,"Summer 2020"]
[]
[null,null,null,null,null,null,null,null,"Fall",null,"Fall 2016",null,"Fall 2017",null,"Fall 2018",null,"Fall 2019",null,"Fall 2020"]
[]
[null,null,null,null,0,0,0,0,"Spring",null,"Spring 2017",null,"Spring 2018",null,"Spring 2019",null,"Spring 2020",null,"Spring 2021"]
[]
["PhD Students (enter no. of students per term)",null,null,null,null,null,null,null,"Summer",null,"Summer 2016",null,"Summer 2017",null,"Summer 2018",null,"Summer 2019",null,"Summer 2020"]
[]
[null,null,null,null,null,null,null,null,"Fall",null,"Fall 2016",null,"Fall 2017",null,"Fall 2018",null,"Fall 2019",null,"Fall 2020"]
[]
[null,null,null,null,null,null,null,null,"Spring",null,"Spring 2017",null,"Spring 2018",null,"Spring 2019",null,"Spring 2020",null,"Spring 2021"]
[]
[]
[8,null,"Graduate Student Tuition (Engineering & Architecture)",null,null,null,"select 1/4-time/1/2-time > >",null,"1/2-time",null,{"$f":"ROUND(IF($I$26=\"1/2-time\",K27,K28),0)","v":0},null,{"$f":"ROUND(IF($I$26=\"1/2-time\",M27,M28),0)","v":0},null,{"$f":"ROUND(IF($I$26=\"1/2-time\",O27,O28),0)","v":0},null,{"$f":"ROUND(IF($I$26=\"1/2-time\",Q27,Q28),0)","v":0},null,{"$f":"ROUND(IF($I$26=\"1/2-time\",S27,S28),0)","v":0}]
[8,null,"Graduate Student Tuition",null,null,null,null,null,"Maximum",null,{"$f":"+C33*VLOOKUP(K33,$I$103:$Q$129,5,FALSE)+C35*VLOOKUP(K35,$I$103:$Q$129,5,FALSE)+C37*VLOOKUP(K37,$I$103:$Q$129,5,FALSE)+C39*VLOOKUP(K39,$I$103:$Q$129,9,FALSE)+C41*VLOOKUP(K41,$I$103:$Q$129,9,FALSE)+C43*VLOOKUP(K43,$I$103:$Q$129,9,FALSE)","v":0},null,{"$f":"+E33*VLOOKUP(M33,$I$103:$Q$129,5,FALSE)+E35*VLOOKUP(M35,$I$103:$Q$129,5,FALSE)+E37*VLOOKUP(M37,$I$103:$Q$129,5,FALSE)+E39*VLOOKUP(M39,$I$103:$Q$129,9,FALSE)+E41*VLOOKUP(M41,$I$103:$Q$129,9,FALSE)+E43*VLOOKUP(M43,$I$103:$Q$129,9,FALSE)","v":0},null,{"$f":"+F33*VLOOKUP(O33,$I$103:$Q$129,5,FALSE)+F35*VLOOKUP(O35,$I$103:$Q$129,5,FALSE)+F37*VLOOKUP(O37,$I$103:$Q$129,5,FALSE)+F39*VLOOKUP(O39,$I$103:$Q$129,9,FALSE)+F41*VLOOKUP(O41,$I$103:$Q$129,9,FALSE)+F43*VLOOKUP(O43,$I$103:$Q$129,9,FALSE)","v":0},null,{"$f":"+G33*VLOOKUP(Q33,$I$103:$Q$129,5,FALSE)+G35*VLOOKUP(Q35,$I$103:$Q$129,5,FALSE)+G37*VLOOKUP(Q37,$I$103:$Q$129,5,FALSE)+G39*VLOOKUP(Q39,$I$103:$Q$129,9,FALSE)+G41*VLOOKUP(Q41,$I$103:$Q$129,9,FALSE)+G43*VLOOKUP(Q43,$I$103:$Q$129,9,FALSE)","v":0},null,{"$f":"+H33*VLOOKUP(S33,$I$103:$Q$129,5,FALSE)+H35*VLOOKUP(S35,$I$103:$Q$129,5,FALSE)+H37*VLOOKUP(S37,$I$103:$Q$129,5,FALSE)+H39*VLOOKUP(S39,$I$103:$Q$129,9,FALSE)+H41*VLOOKUP(S41,$I$103:$Q$129,9,FALSE)+H43*VLOOKUP(S43,$I$103:$Q$129,9,FALSE)","v":0}]
[8,null,"Graduate Student Tuition",null,null,null,null,null,"Minimum",null,{"$f":"+C33*VLOOKUP(K33,$I$103:$Q$129,3,FALSE)+C35*VLOOKUP(K35,$I$103:$Q$129,3,FALSE)+C37*VLOOKUP(K37,$I$103:$Q$129,3,FALSE)+C39*VLOOKUP(K39,$I$103:$Q$129,7,FALSE)+C41*VLOOKUP(K41,$I$103:$Q$129,7,FALSE)+C43*VLOOKUP(K43,$I$103:$Q$129,7,FALSE)","v":0},null,{"$f":"+E33*VLOOKUP(M33,$I$103:$Q$129,3,FALSE)+E35*VLOOKUP(M35,$I$103:$Q$129,3,FALSE)+E37*VLOOKUP(M37,$I$103:$Q$129,3,FALSE)+E39*VLOOKUP(M39,$I$103:$Q$129,7,FALSE)+E41*VLOOKUP(M41,$I$103:$Q$129,7,FALSE)+E43*VLOOKUP(M43,$I$103:$Q$129,7,FALSE)","v":0},null,{"$f":"+F33*VLOOKUP(O33,$I$103:$Q$129,3,FALSE)+F35*VLOOKUP(O35,$I$103:$Q$129,3,FALSE)+F37*VLOOKUP(O37,$I$103:$Q$129,3,FALSE)+F39*VLOOKUP(O39,$I$103:$Q$129,7,FALSE)+F41*VLOOKUP(O41,$I$103:$Q$129,7,FALSE)+F43*VLOOKUP(O43,$I$103:$Q$129,7,FALSE)","v":0},null,{"$f":"+G33*VLOOKUP(Q33,$I$103:$Q$129,3,FALSE)+G35*VLOOKUP(Q35,$I$103:$Q$129,3,FALSE)+G37*VLOOKUP(Q37,$I$103:$Q$129,3,FALSE)+G39*VLOOKUP(Q39,$I$103:$Q$129,7,FALSE)+G41*VLOOKUP(Q41,$I$103:$Q$129,7,FALSE)+G43*VLOOKUP(Q43,$I$103:$Q$129,7,FALSE)","v":0},null,{"$f":"+H33*VLOOKUP(S33,$I$103:$Q$129,3,FALSE)+H35*VLOOKUP(S35,$I$103:$Q$129,3,FALSE)+H37*VLOOKUP(S37,$I$103:$Q$129,3,FALSE)+H39*VLOOKUP(S39,$I$103:$Q$129,7,FALSE)+H41*VLOOKUP(S41,$I$103:$Q$129,7,FALSE)+H43*VLOOKUP(S43,$I$103:$Q$129,7,FALSE)","v":0}]
[]
[]
{"$rows_left_out":129}
{"sheet":"SPA USE ONLY","index":7,"n_rows":31,"n_cols":3,"rows_kept":31,"cut":false,"hidden":false,"merged":[]}
["Sponsor:","NIH"]
["Title: "]
["PI Name: "]
["Period of Performance:"]
["Account Number:"]
[]
["Budget Categories","Budget Code","Amount"]
["Salary/Hourly","0108",{"$f":"ROUND(SUM('Base Budget'!L90:T90),0)","v":0}]
["Payroll Benefits","0130",{"$f":"ROUND(SUM('Base Budget'!L98:T98),0)","v":0}]
["Equipment","0710",{"$f":"ROUND(SUM('Base Budget'!L117:T117),0)","v":0}]
["Travel Domestic","0215",{"$f":"ROUND(SUM('Base Budget'!L156:T156),0)","v":0}]
["Travel Foreign","0216",0]
["Student Tuition","0610",{"$f":"ROUND(SUM('Base Budget'!L168:T170),0)","v":0}]
["Supplies","0410",{"$f":"ROUND(SUM('Base Budget'!L134:T134),0)","v":0}]
["Subcontracts"]
["Subject to IDC","0396",{"$f":"ROUND('Base Budget'!AF192,0)","v":0}]
["Not Subejct to IDC","0376",{"$f":"ROUND('Base Budget'!AH192,0)","v":0}]
["Other Direct Costs"]
["Telecom Charges","0340",0]
["Computer Usage","0353",0]
["Printing/Copying","0373",0]
["Services/Honoraria","0302",{"$f":"ROUND(SUM('Base Budget'!L108:T108),0)","v":0}]
["Postage","0379",0]
["Other  ","0630",{"$f":"ROUND(SUM('Base Budget'!L140:T140)+SUM('Base Budget'!L148:T148)+SUM('Base Budget'!L160:'Base Budget'!T167),0)","v":0}]
["Total Direct Costs",null,{"$f":"SUM(C8:C24)","v":0}]
["Indirect Costs","0642",{"$f":"ROUND(SUM('Base Budget'!L201:T201),0)","v":0}]
["Total Costs",null,{"$f":"SUM(C25:C26)","v":0}]
[]
[]
["Okay to Upload"]
{"$rows_left_out":1}